Reaction Details
TargetNeprilysin
LigandBDBM21641
Substrate/Competitorn/a
Meas. Tech.ChEBML_144600
IC50 6±n/a nM
Citation Bhagwat, SSFink, CAGude, CChan, KQiao, YSakane, YBerry, CGhai, RD 4-Substituted proline derivatives that inhibit angiotensin converting enzyme and neutral endopeptidase 24.11. Bioorg Med Chem Lett4:2673-2676 (1994)    Article
 
Neprilysin
Name:Neprilysin
Type:Protein
Mol. Mass.:85789.59
Organism:Rattus norvegicus (Rat)
Description:P07861
Residue:750
BDBM21641
NameBDBM21641
Synonyms:2-(2-benzyl-3-sulfanylpropanamido)acetic acid Thiorphan
TypeSmall organic molecule
Emp. Form.C12H15NO3S
Mol. Mass.253.317
SMILESOC(=O)CNC(=O)C(CS)Cc1ccccc1