Reaction Details
TargetDiphosphomevalonate decarboxylase
LigandBDBM50287715
Substrate/Competitorn/a
Meas. Tech.ChEBML_105296
IC50 15±n/a nM
Citation Vlattas, IDellureficio, JKu, EBohacek, RXiaolu, Zhang Inhibition of mevalonate 5-pyrophosphate decarboxylase by a proline-containing transition state analog Bioorg Med Chem Lett6:2091-2096 (1996)    Article
 
Diphosphomevalonate decarboxylase
Name:Diphosphomevalonate decarboxylase
Type:PROTEIN
Mol. Mass.:43408.12
Organism:Homo sapiens (Human)
Description:ChEMBL_105297
Residue:400
BDBM50287715
NameBDBM50287715
Synonyms:(2R)-1-({[(phosphonatooxy)phosphinato]oxy}acetyl)pyrrolidine-2-carboxylate
TypeSmall organic molecule
Emp. Form.C7H9NO10P2
Mol. Mass.329.0968
SMILES[O-]C(=O)[C@H]1CCCN1C(=O)COP([O-])(=O)OP([O-])([O-])=O