Reaction Details
TargetBeta-3 adrenergic receptor
LigandBDBM50290497
Substrate/Competitorn/a
Meas. Tech.ChEBML_38792
EC50 2200±n/a nM
Citation Beeley, LBerge, JChapman, HDean, DKelly, JLowden, KKotecha, NMorgan, HRami, HThompson, MVong, AWard, R A simplified template approach towards the synthesis of a potent beta-3 adrenoceptor agonist at the human receptor Bioorg Med Chem Lett7:219-224 (1997)    Article
 
Beta-3 adrenergic receptor
Name:Beta-3 adrenergic receptor
Type:G Protein-Coupled Receptor (GPCR)
Mol. Mass.:43534.88
Organism:Homo sapiens (Human)
Description:n/a
Residue:408
BDBM50290497
NameBDBM50290497
Synonyms:4-{2-Hydroxy-3-[2-(4-methoxy-phenyl)-ethylamino]-propoxy}-1,3-dihydro-benzoimidazol-2-one | CHEMBL421489
TypeSmall organic molecule
Emp. Form.C19H23N3O4
Mol. Mass.357.4036
SMILESCOc1ccc(CCNC[C@@H](O)COc2cccc3[nH]c(=O)[nH]c23)cc1