Reaction Details
TargetD(4) dopamine receptor
LigandBDBM50291681
Substrate/Competitorn/a
Meas. Tech.ChEMBL_58936 (CHEMBL671251)
Ki 500±n/a nM
Citation Hegde, VRDai, PLadislaw, CPatel, MGPuar, MSPachter, JA D4 dopamine receptor-selective compounds from the Chinese plant Phoebe chekiangensis Bioorg Med Chem Lett7:1207-1212 (1997)    Article
 
D(4) dopamine receptor
Name:D(4) dopamine receptor
Type:Enzyme
Mol. Mass.:48373.19
Organism:Homo sapiens (Human)
Description:P21917
Residue:419
BDBM50291681
NameBDBM50291681
Synonyms:2,3-Dihydro-1H-indol-5-ol | CHEMBL19331
TypeSmall organic molecule
Emp. Form.C8H9NO
Mol. Mass.135.1632
SMILESOc1ccc2NCCc2c1