Reaction Details
TargetD(2) dopamine receptor
LigandBDBM50450614
Substrate/Competitorn/a
Meas. Tech.ChEMBL_58464 (CHEMBL670395)
Ki 11400±n/a nM
Citation Hegde, VRDai, PLadislaw, CPatel, MGPuar, MSPachter, JA D4 dopamine receptor-selective compounds from the Chinese plant Phoebe chekiangensis Bioorg Med Chem Lett7:1207-1212 (1997)    Article
 
D(2) dopamine receptor
Name:D(2) dopamine receptor
Type:Cell-surface receptors
Mol. Mass.:50647.10
Organism:Homo sapiens (Human)
Description:P14416
Residue:443
BDBM50450614
NameBDBM50450614
Synonyms:CHEMBL2303762
TypeSmall organic molecule
Emp. Form.C22H27NO8
Mol. Mass.433.4517
SMILESOC[C@H]1O[C@H](Oc2ccc(CC3NCCc4cc(O)c(O)cc34)cc2)[C@H](O)[C@H](O)[C@H]1O