Reaction Details
TargetD(2) dopamine receptor
LigandBDBM50291684
Substrate/Competitorn/a
Meas. Tech.ChEBML_58464
Ki 5400±n/a nM
Citation Hegde, VRDai, PLadislaw, CPatel, MGPuar, MSPachter, JA D4 dopamine receptor-selective compounds from the Chinese plant Phoebe chekiangensis Bioorg Med Chem Lett7:1207-1212 (1997)    Article
 
D(2) dopamine receptor
Name:D(2) dopamine receptor
Type:Cell-surface receptors
Mol. Mass.:50647.10
Organism:Homo sapiens (Human)
Description:P14416
Residue:443
BDBM50291684
NameBDBM50291684
Synonyms:1-Methyl-1,2,3,4-tetrahydro-isoquinoline-6,7-diol CHEMBL416732
TypeSmall organic molecule
Emp. Form.C10H13NO2
Mol. Mass.179.2157
SMILESCC1NCCc2cc(O)c(O)cc12