Reaction Details
TargetNeuromedin-B receptor
LigandBDBM50071746
Substrate/Competitorn/a
Meas. Tech.ChEBML_39622
Ki 0.320000±n/a nM
Citation Ashwood, VBrownhill, VHigginbottom, MHorwell, DCHughes, JLewthwaite, RAMcKnight, ATPinnock, RDPritchard, MCSuman-Chauhan, NWebb, CWilliams, SC PD 176252--the first high affinity non-peptide gastrin-releasing peptide (BB2) receptor antagonist. Bioorg Med Chem Lett8:2589-94 (1999) Neuromedin-B receptor
Name:Neuromedin-B receptor
Type:Enzyme Catalytic Domain
Mol. Mass.:43447.11
Organism:Homo sapiens (Human)
Description:Bombesin 1 NMBR 0::P28336
Residue:390
BDBM50071746
NameBDBM50071746
Synonyms:(S)-2-[3-(4-Cyano-phenyl)-ureido]-3-(1H-indol-3-yl)-2-methyl-N-(1-pyridin-2-yl-cyclohexylmethyl)-propionamide | CHEMBL327840
TypeSmall organic molecule
Emp. Form.C32H34N6O2
Mol. Mass.534.6514
SMILESC[C@@](Cc1c[nH]c2ccccc12)(NC(=O)Nc1ccc(cc1)C#N)C(=O)NCC1(CCCCC1)c1ccccn1