Reaction Details
TargetGastrin-releasing peptide receptor
LigandBDBM50071752
Substrate/Competitorn/a
Meas. Tech.ChEBML_39763
Ki 1096±n/a nM
Citation Ashwood, VBrownhill, VHigginbottom, MHorwell, DCHughes, JLewthwaite, RAMcKnight, ATPinnock, RDPritchard, MCSuman-Chauhan, NWebb, CWilliams, SC PD 176252--the first high affinity non-peptide gastrin-releasing peptide (BB2) receptor antagonist. Bioorg Med Chem Lett8:2589-94 (1999) Gastrin-releasing peptide receptor
Name:Gastrin-releasing peptide receptor
Type:Enzyme Catalytic Domain
Mol. Mass.:43214.53
Organism:Homo sapiens (Human)
Description:Bombesin 2 GRPR 0::P30550
Residue:384
BDBM50071752
NameBDBM50071752
Synonyms:(S)-3-(1H-Indol-3-yl)-2-methyl-2-(3-phenyl-ureido)-N-(1-pyridin-2-yl-cyclohexylmethyl)-propionamide | CHEMBL87079
TypeSmall organic molecule
Emp. Form.C31H35N5O2
Mol. Mass.509.6419
SMILESC[C@@](Cc1c[nH]c2ccccc12)(NC(=O)Nc1ccccc1)C(=O)NCC1(CCCCC1)c1ccccn1