Reaction Details
TargetGastrin-releasing peptide receptor
LigandBDBM50071745
Substrate/Competitorn/a
Meas. Tech.ChEBML_39763
Ki 56±n/a nM
Citation Ashwood, VBrownhill, VHigginbottom, MHorwell, DCHughes, JLewthwaite, RAMcKnight, ATPinnock, RDPritchard, MCSuman-Chauhan, NWebb, CWilliams, SC PD 176252--the first high affinity non-peptide gastrin-releasing peptide (BB2) receptor antagonist. Bioorg Med Chem Lett8:2589-94 (1999) Gastrin-releasing peptide receptor
Name:Gastrin-releasing peptide receptor
Type:Enzyme Catalytic Domain
Mol. Mass.:43214.53
Organism:Homo sapiens (Human)
Description:Bombesin 2 GRPR 0::P30550
Residue:384
BDBM50071745
NameBDBM50071745
Synonyms:CHEMBL403317 Gly-Asn-Leu-Trp-Ala-Thr-Gly-His-Phe-Met-NH2(Neuromedin B) | NMB
TypeSmall organic molecule
Emp. Form.C52H73N15O12S
Mol. Mass.1132.294
SMILESCSCC[C@H](NC(=O)[C@H](Cc1ccccc1)NC(=O)[C@H](Cc1cnc[nH]1)NC(=O)CNC(=O)[C@@H](NC(=O)[C@H](C)NC(=O)[C@H](Cc1c[nH]c2ccccc12)NC(=O)[C@H](CC(C)C)NC(=O)[C@H](CC(N)=O)NC(=O)CN)[C@@H](C)O)C(N)=O