Reaction Details
TargetNeuromedin-B receptor
LigandBDBM50071743
Substrate/Competitorn/a
Meas. Tech.ChEBML_39622
Ki 0.460000±n/a nM
Citation Ashwood, VBrownhill, VHigginbottom, MHorwell, DCHughes, JLewthwaite, RAMcKnight, ATPinnock, RDPritchard, MCSuman-Chauhan, NWebb, CWilliams, SC PD 176252--the first high affinity non-peptide gastrin-releasing peptide (BB2) receptor antagonist. Bioorg Med Chem Lett8:2589-94 (1999) Neuromedin-B receptor
Name:Neuromedin-B receptor
Type:Enzyme Catalytic Domain
Mol. Mass.:43447.11
Organism:Homo sapiens (Human)
Description:Bombesin 1 NMBR 0::P28336
Residue:390
BDBM50071743
NameBDBM50071743
Synonyms:(S)-3-(1H-Indol-3-yl)-N-[1-(4-methoxy-phenyl)-cyclohexylmethyl]-2-methyl-2-[3-(4-nitro-phenyl)-ureido]-propionamide | CHEMBL312926
TypeSmall organic molecule
Emp. Form.C33H37N5O5
Mol. Mass.583.6774
SMILESCOc1ccc(cc1)C1(CNC(=O)[C@](C)(Cc2c[nH]c3ccccc23)NC(=O)Nc2ccc(cc2)[N+]([O-])=O)CCCCC1