Reaction Details
TargetKynurenine 3-monooxygenase
LigandBDBM50072255
Substrate/Competitorn/a
Meas. Tech.ChEMBL_216337 (CHEMBL818751)
IC50 1100±n/a nM
Citation Giordani, APevarello, PCini, MBormetti, RGreco, FToma, SSpeciale, CVarasi, M 4-Phenyl-4-oxo-butanoic acid derivatives inhibitors of kynurenine 3-hydroxylase. Bioorg Med Chem Lett8:2907-12 (1999) Kynurenine 3-monooxygenase
Name:Kynurenine 3-monooxygenase
Type:PROTEIN
Mol. Mass.:54371.88
Organism:Rattus norvegicus
Description:ChEMBL_1487468
Residue:478
BDBM50072255
NameBDBM50072255
Synonyms:(E)-4-(3,4-Difluoro-phenyl)-4-oxo-but-2-enoic acid | CHEMBL98775
TypeSmall organic molecule
Emp. Form.C10H6F2O3
Mol. Mass.212.1496
SMILESOC(=O)\C=C\C(=O)c1ccc(F)c(F)c1