Reaction Details
TargetSubstance-P receptor
LigandBDBM50069864
Substrate/Competitorn/a
Meas. Tech.ChEBML_205567
IC50 0.140000±n/a nM
Citation Rosen, TJCoffman, KJMcLean, SCrawford, RTBryce, DKGohda, YTsuchiya, MNagahisa, ANakane, MLowe, JA Synthesis and structure-activity relationships of CP-122,721, a second-generation NK-1 receptor antagonist. Bioorg Med Chem Lett8:281-4 (1999) Substance-P receptor
Name:Substance-P receptor
Type:G Protein-Coupled Receptor (GPCR)
Mol. Mass.:46254.43
Organism:Homo sapiens (Human)
Description:P25103
Residue:407
BDBM50069864
NameBDBM50069864
Synonyms:(5-Chloro-2-methoxy-benzyl)-((2S,3S)-2-phenyl-piperidin-3-yl)-amine | CHEMBL437075
TypeSmall organic molecule
Emp. Form.C19H23ClN2O
Mol. Mass.330.852
SMILESCOc1ccc(Cl)cc1CN[C@H]1CCCN[C@H]1c1ccccc1