Reaction Details
TargetAminopeptidase B
LigandBDBM50078122
Substrate/Competitorn/a
Meas. Tech.ChEBML_35337
Ki>0.000±n/a nM
Comments>0.0000100 01/04/22
Citation Chen, HRoques, BPFournié-Zaluski, MC Design of the first highly potent and selective aminopeptidase N (EC 3.4.11.2) inhibitor. Bioorg Med Chem Lett9:1511-6 (1999) Aminopeptidase B
Name:Aminopeptidase B
Type:PROTEIN
Mol. Mass.:72401.87
Organism:Mus musculus
Description:ChEMBL_35337
Residue:650
BDBM50078122
NameBDBM50078122
Synonyms:(R)-1-{[(S)-2-((S)-1-Carboxy-1-methyl-2-phenyl-ethylcarbamoyl)-3-phenyl-propyl]-hydroxy-phosphinoyl}-2-phenyl-ethyl-ammonium
TypeSmall organic molecule
Emp. Form.C28H34N2O5P
Mol. Mass.509.5532
SMILESC[C@@](Cc1ccccc1)(NC(=O)[C@H](Cc1ccccc1)CP(O)(=O)[C@@H]([NH3+])Cc1ccccc1)C(O)=O