Reaction Details
TargetCalpain-1 catalytic subunit
LigandBDBM50366611
Substrate/Competitorn/a
Meas. Tech.ChEMBL_43488 (CHEMBL657761)
Ki 1500±n/a nM
Citation Peet, NPKim, HOMarquart, ALAngelastro, MRNieduzak, TRWhite, JNFriedrich, DFlynn, GAWebster, MEVaz, RJLinnik, MDKoehl, JRMehdi, SBey, PEmary, BHwang, KK Hydroxyoxazolidines as alpha-aminoacetaldehye equivalents: novel inhibitors of calpain. Bioorg Med Chem Lett9:2365-70 (1999) Calpain-1 catalytic subunit
Name:Calpain-1 catalytic subunit
Type:Protein
Mol. Mass.:81880.51
Organism:Homo sapiens (Human)
Description:n/a
Residue:714
BDBM50366611
NameBDBM50366611
Synonyms:CHEMBL1794816
TypeSmall organic molecule
Emp. Form.C23H26N2O5
Mol. Mass.410.4629
SMILESO[C@H]1O[C@@H]2CCC[C@H](NC(=O)OCc3ccccc3)C(=O)N2[C@@H]1Cc1ccccc1