Reaction Details
TargetCoagulation factor X
LigandBDBM50081009
Substrate/Competitorn/a
Meas. Tech.ChEBML_48479
Ki 6±n/a nM
Citation Choi-Sledeski, YMBecker, MRGreen, DMDavis, REwing, WRMason, HJLy, CSpada, ALiang, GCheney, DBarton, JChu, VBrown, KColussi, DBentley, RLeadley, RDunwiddie, CPauls, HW Aminoisoquinolines: design and synthesis of an orally active benzamidine isostere for the inhibition of factor XA. Bioorg Med Chem Lett9:2539-44 (1999) Coagulation factor X
Name:Coagulation factor X
Type:PROTEIN
Mol. Mass.:54498.45
Organism:Bos taurus
Description:ChEMBL_1364435
Residue:492
BDBM50081009
NameBDBM50081009
Synonyms:CHEMBL85938 | Thieno[3,2-b]pyridine-2-sulfonic acid [1-(1,6-diamino-isoquinolin-7-ylmethyl)-2-oxo-pyrrolidin-3-yl]-amide
TypeSmall organic molecule
Emp. Form.C21H20N6O3S2
Mol. Mass.468.552
SMILESNc1cc2ccnc(N)c2cc1CN1CC[C@H](NS(=O)(=O)c2cc3ncccc3s2)C1=O