Reaction Details
TargetCoagulation factor X
LigandBDBM13279
Substrate/Competitorn/a
Meas. Tech.ChEBML_48479
Ki 7±n/a nM
Citation Choi-Sledeski, YMBecker, MRGreen, DMDavis, REwing, WRMason, HJLy, CSpada, ALiang, GCheney, DBarton, JChu, VBrown, KColussi, DBentley, RLeadley, RDunwiddie, CPauls, HW Aminoisoquinolines: design and synthesis of an orally active benzamidine isostere for the inhibition of factor XA. Bioorg Med Chem Lett9:2539-44 (1999) Coagulation factor X
Name:Coagulation factor X
Type:PROTEIN
Mol. Mass.:54498.45
Organism:Bos taurus
Description:ChEMBL_1364435
Residue:492
BDBM13279
NameBDBM13279
Synonyms:4-{[(3S)-3-[(7-methoxynaphthalene-2-)(methyl)sulfonamido]-2-oxopyrrolidin-1-yl]methyl}thiophene-2-carboximidamide CHEMBL84638 Sulfonamidopyrrolidinone
TypeSmall organic molecule
Emp. Form.C22H24N4O4S2
Mol. Mass.472.58
SMILESCOc1ccc2ccc(cc2c1)S(=O)(=O)N(C)[C@H]1CCN(Cc2csc(c2)C(N)=N)C1=O