Reaction Details
TargetD(2) dopamine receptor
LigandBDBM50082322
Substrate/Competitorn/a
Meas. Tech.ChEBML_58552
IC50>10000±n/a nM
Citation Annoura, HNakanishi, KUesugi, MFukunaga, AMiyajima, ATamura-Horikawa, YTamura, S A novel class of Na+ and Ca2+ channel dual blockers with highly potent anti-ischemic effects. Bioorg Med Chem Lett9:2999-3002 (1999) D(2) dopamine receptor
Name:D(2) dopamine receptor
Type:G Protein-Coupled Receptor (GPCR)
Mol. Mass.:50931.60
Organism:Rattus norvegicus (rat)
Description:P61169
Residue:444
BDBM50082322
NameBDBM50082322
Synonyms:1-{4-[4-(4-Fluoro-benzyl)-phenyl]-piperidin-1-yl}-3-phenoxy-propan-2-ol; hydrochloride | CHEMBL543622
TypeSmall organic molecule
Emp. Form.C27H30FNO2
Mol. Mass.419.531
SMILESOC(COc1ccccc1)CN1CCC(CC1)c1ccc(Cc2ccc(F)cc2)cc1