Reaction Details
TargetTyrosine--tRNA ligase, cytoplasmic
LigandBDBM50091496
Substrate/Competitorn/a
Meas. Tech.ChEBML_211026
IC50 21±n/a nM
Citation Berge, JMCopley, RCEggleston, DSHamprecht, DWJarvest, RLMensah, LMO'Hanlon, PJPope, AJ Inhibitors of bacterial tyrosyl tRNA synthetase: synthesis of four stereoisomeric analogues of the natural product SB-219383. Bioorg Med Chem Lett10:1811-4 (2000) Tyrosine--tRNA ligase, cytoplasmic
Name:Tyrosine--tRNA ligase, cytoplasmic
Type:PROTEIN
Mol. Mass.:59145.78
Organism:Homo sapiens (Human)
Description:ChEMBL_211030
Residue:528
BDBM50091496
NameBDBM50091496
Synonyms:(R)-[(S)-2-Amino-3-(4-hydroxy-phenyl)-propionylamino]-((2S,3S,4S,5S)-1,3,4,5-tetrahydroxy-piperidin-2-yl)-acetic acid | CHEMBL52779
TypeSmall organic molecule
Emp. Form.C16H23N3O8
Mol. Mass.385.3691
SMILESN[C@@H](Cc1ccc(O)cc1)C(=O)N[C@H]([C@H]1[C@H](O)[C@@H](O)[C@@H](O)CN1O)C(O)=O