Reaction Details
TargetMu-type opioid receptor
LigandBDBM50087698
Substrate/Competitorn/a
Meas. Tech.ChEBML_149009
Ki 4±n/a nM
Citation Röver, SWichmann, JJenck, FAdam, GCesura, AM ORL1 receptor ligands: structure-activity relationships of 8-cycloalkyl-1-phenyl-1,3,8-triaza-spiro[4.5]decan-4-ones. Bioorg Med Chem Lett10:831-4 (2000) Mu-type opioid receptor
Name:Mu-type opioid receptor
Type:G Protein-Coupled Receptor (GPCR)
Mol. Mass.:44503.11
Organism:Rattus norvegicus (rat)
Description:Competition binding assays were carried out using membrane preparations from transfected HN9.10 cells that constitutively expressed the mu opioid receptor.
Residue:398
BDBM50087698
NameBDBM50087698
Synonyms:8-(R)-Acenaphthen-1-yl-1-phenyl-1,3,8-triaza-spiro[4.5]decan-4-one | CHEMBL355202
TypeSmall organic molecule
Emp. Form.C25H25N3O
Mol. Mass.383.4855
SMILESO=C1NCN(c2ccccc2)C11CCN(CC1)[C@@H]1Cc2cccc3cccc1c23