Reaction Details
TargetMu-type opioid receptor
LigandBDBM50087691
Substrate/Competitorn/a
Meas. Tech.ChEBML_149009
Ki 3.2±n/a nM
Citation Röver, SWichmann, JJenck, FAdam, GCesura, AM ORL1 receptor ligands: structure-activity relationships of 8-cycloalkyl-1-phenyl-1,3,8-triaza-spiro[4.5]decan-4-ones. Bioorg Med Chem Lett10:831-4 (2000) Mu-type opioid receptor
Name:Mu-type opioid receptor
Type:G Protein-Coupled Receptor (GPCR)
Mol. Mass.:44503.11
Organism:Rattus norvegicus (rat)
Description:Competition binding assays were carried out using membrane preparations from transfected HN9.10 cells that constitutively expressed the mu opioid receptor.
Residue:398
BDBM50087691
NameBDBM50087691
Synonyms:8-(4-Isopropyl-cyclohexyl)-1-phenyl-1,3,8-triaza-spiro[4.5]decan-4-one | CHEMBL166387
TypeSmall organic molecule
Emp. Form.C22H33N3O
Mol. Mass.355.5169
SMILESCC(C)[C@H]1CC[C@H](CC1)N1CCC2(CC1)N(CNC2=O)c1ccccc1