Reaction Details
TargetSubstance-K receptor
LigandBDBM50279775
Substrate/Competitorn/a
Meas. Tech.ChEBML_209035
Ki 0.600000±n/a nM
Citation Bernstein, PRAharony, DAlbert, JSAndisik, DBarthlow, HGBialecki, RDavenport, TDedinas, RFDembofsky, BTKoether, GKosmider, BJKirkland, KOhnmacht, CJPotts, WRumsey, WLShen, LShenvi, ASherwood, SStollman, DRussell, K Discovery of novel, orally active dual NK1/NK2 antagonists. Bioorg Med Chem Lett11:2769-73 (2001) Substance-K receptor
Name:Substance-K receptor
Type:Protein
Mol. Mass.:44455.78
Organism:Homo sapiens (Human)
Description:P21452
Residue:398
BDBM50279775
NameBDBM50279775
Synonyms:(S)-3-Cyano-naphthalene-1-carboxylic acid {2-(3,4-dichloro-phenyl)-4-[4-(2-methanesulfinyl-phenyl)-piperidin-1-yl]-butyl}-methyl-amide CHEMBL129683
TypeSmall organic molecule
Emp. Form.C35H35Cl2N3O2S
Mol. Mass.632.642
SMILESCN(C[C@@H](CCN1CCC(CC1)c1ccccc1[S@](C)=O)c1ccc(Cl)c(Cl)c1)C(=O)c1cc(cc2ccccc12)C#N