Reaction Details
TargetDisintegrin and metalloproteinase domain-containing protein 17
LigandBDBM50096463
Substrate/Competitorn/a
Meas. Tech.ChEBML_212740
IC50 356±n/a nM
Citation Levin, JIChen, JMDu, MTNelson, FCWehr, TDiJoseph, JFKillar, LMSkala, SSung, ASharr, MARoth, CEJin, GCowling, RDi, LSherman, MXu, ZBMarch, CJMohler, KMBlack, RASkotnicki, JS The discovery of anthranilic acid-based MMP inhibitors. Part 3: incorporation of basic amines. Bioorg Med Chem Lett11:2975-8 (2001) Disintegrin and metalloproteinase domain-containing protein 17
Name:Disintegrin and metalloproteinase domain-containing protein 17
Type:Enzyme
Mol. Mass.:93007.89
Organism:Homo sapiens (Human)
Description:
Residue:824
BDBM50096463
NameBDBM50096463
Synonyms:CHEMBL70176 N-hydroxy-2-(4-methoxy-N-(pyridin-3-ylmethyl)phenylsulfonamido)-3-methylbenzamide
TypeSmall organic molecule
Emp. Form.C21H21N3O5S
Mol. Mass.427.474
SMILESCOc1ccc(cc1)S(=O)(=O)N(Cc1cccnc1)c1c(C)cccc1C(=O)NO