Reaction Details
TargetMatrix metalloproteinase-9
LigandBDBM50106130
Substrate/Competitorn/a
Meas. Tech.ChEBML_105530
IC50 1±n/a nM
Citation Levin, JIChen, JMDu, MTNelson, FCWehr, TDiJoseph, JFKillar, LMSkala, SSung, ASharr, MARoth, CEJin, GCowling, RDi, LSherman, MXu, ZBMarch, CJMohler, KMBlack, RASkotnicki, JS The discovery of anthranilic acid-based MMP inhibitors. Part 3: incorporation of basic amines. Bioorg Med Chem Lett11:2975-8 (2001) Matrix metalloproteinase-9
Name:Matrix metalloproteinase-9
Type:Enzyme
Mol. Mass.:78452.28
Organism:Homo sapiens (Human)
Description:P14780
Residue:707
BDBM50106130
NameBDBM50106130
Synonyms:CHEMBL100512 | N-Hydroxy-2-[(4-methoxy-benzenesulfonyl)-methyl-amino]-3-(4-methyl-piperazin-1-ylmethyl)-benzamide
TypeSmall organic molecule
Emp. Form.C21H28N4O5S
Mol. Mass.448.536
SMILESCOc1ccc(cc1)S(=O)(=O)N(C)c1c(CN2CCN(C)CC2)cccc1C(=O)NO