Reaction Details
TargetVasopressin V1a receptor
LigandBDBM50108501
Substrate/Competitorn/a
Meas. Tech.ChEBML_214566
Ki 0.102000±n/a nM
Citation Kakefuda, ATsukada, JKusayama, TTahara, ATsukamoto, S N-Methylbenzanilide derivatives as a novel class of selective V(1A) receptor antagonists. Bioorg Med Chem Lett12:229-32 (2001) Vasopressin V1a receptor
Name:Vasopressin V1a receptor
Type:Enzyme Catalytic Domain
Mol. Mass.:47674.81
Organism:RAT
Description:VASOPRESSIN V1A AVPR1A RAT::P30560
Residue:424
BDBM50108501
NameBDBM50108501
Synonyms:2-Methyl-furan-3-carboxylic acid (4-{5-[2-(4-dimethylamino-piperidin-1-yl)-2-oxo-ethylidene]-4,4-difluoro-2,3,4,5-tetrahydro-benzo[b]azepine-1-carbonyl}-phenyl)-amide | CHEMBL310921
TypeSmall organic molecule
Emp. Form.C32H34F2N4O4
Mol. Mass.576.6336
SMILESCN(C)C1CCN(CC1)C(=O)\C=C1/c2ccccc2N(CCC1(F)F)C(=O)c1ccc(NC(=O)c2ccoc2C)cc1