Reaction Details
TargetD(2) dopamine receptor
LigandBDBM50061669
Substrate/Competitorn/a
Meas. Tech.ChEBML_61802
Ki 10±n/a nM
Citation Mewshaw, REZhao, RShi, XMarquis, KBrennan, JAMazandarani, HCoupet, JAndree, TH New generation dopaminergic agents. Part 8: heterocyclic bioisosteres that exploit the 7-OH-2-(aminomethyl)chroman D(2) template. Bioorg Med Chem Lett12:271-4 (2002) D(2) dopamine receptor
Name:D(2) dopamine receptor
Type:Cell-surface receptors
Mol. Mass.:50647.10
Organism:Homo sapiens (Human)
Description:P14416
Residue:443
BDBM50061669
NameBDBM50061669
Synonyms:(R)-2-(Benzylamino-methyl)-chroman-7-ol; oxalic acid CHEMBL64553
TypeSmall organic molecule
Emp. Form.C17H19NO2
Mol. Mass.269.3383
SMILESOc1ccc2CC[C@H](CNCc3ccccc3)Oc2c1