Reaction Details
TargetSerine/threonine-protein phosphatase 2A 55 kDa regulatory subunit B
LigandBDBM50110681
Substrate/Competitorn/a
Meas. Tech.ChEMBL_161772 (CHEMBL767488)
IC50 2±n/a nM
Citation McCluskey, AKeane, MAWalkom, CCBowyer, MCSim, ATYoung, DJSakoff, JA The first two cantharidin analogues displaying PP1 selectivity. Bioorg Med Chem Lett12:391-3 (2002) Serine/threonine-protein phosphatase 2A 55 kDa regulatory subunit B
Name:Serine/threonine-protein phosphatase 2A 55 kDa regulatory subunit B
Synonyms:Serine-threonine protein phosphatase 2A regulatory subunit
Type:PROTEIN
Mol. Mass.:49694.81
Organism:Gallus gallus
Description:ChEMBL_161937
Residue:426
BDBM50110681
NameBDBM50110681
TypeSmall organic molecule
Emp. Form.C50H81N4O15P
Mol. Mass.1009.1697
SMILESCOC[C@@H]([C@H](O)[C@H](O)C(=O)NCC[C@H](C)c1nc(\C=C\C[C@@H]2O[C@]3(C[C@@H](O)[C@@H]2C)O[C@H]([C@H](C[C@H](O)[C@H](C)[C@H](O)[C@H](C)\C=C(/C)\C(\C)=C\C=C\C(\C)=C/C#N)OC)[C@H](OP(O)(O)=O)C3(C)C)co1)N(C)C