Reaction Details
TargetAminopeptidase N
LigandBDBM50131276
Substrate/Competitorn/a
Meas. Tech.ChEBML_35508
IC50 28±n/a nM
Citation Flipo, MFlorent, IGrellier, PSergheraert, CDeprez-Poulain, R Design, synthesis and antimalarial activity of novel, quinoline-based, zinc metallo-aminopeptidase inhibitors. Bioorg Med Chem Lett13:2659-62 (2003) Aminopeptidase N
Name:Aminopeptidase N
Type:PROTEIN
Mol. Mass.:109522.63
Organism:Homo sapiens (Human)
Description:ChEMBL_1507526
Residue:967
BDBM50131276
NameBDBM50131276
Synonyms:CHEMBL328470 | N-(3-{4-[3-(7-Chloro-quinolin-4-ylamino)-propyl]-piperazin-1-yl}-propyl)-N'-hydroxy-N-isobutyl-malonamide
TypeSmall organic molecule
Emp. Form.C26H39ClN6O3
Mol. Mass.519.079
SMILESCC(C)CN(CCCN1CCN(CCCNc2ccnc3cc(Cl)ccc23)CC1)C(=O)CC(=O)NO