Reaction Details
TargetCarbonic anhydrase 2
LigandBDBM50135614
Substrate/Competitorn/a
Meas. Tech.ChEBML_45085
Ki 2.8±n/a nM
Citation Casini, AScozzafava, AMincione, FMenabuoni, LStarnotti, MSupuran, CT Carbonic anhydrase inhibitors: topically acting antiglaucoma sulfonamides incorporating esters and amides of 3- and 4-carboxybenzolamide. Bioorg Med Chem Lett13:2867-73 (2003) Carbonic anhydrase 2
Name:Carbonic anhydrase 2
Type:Enzyme
Mol. Mass.:29250.71
Organism:Homo sapiens (Human)
Description:P00918
Residue:260
BDBM50135614
NameBDBM50135614
Synonyms:4-(5-Sulfamoyl-[1,3,4]thiadiazol-2-ylsulfamoyl)-benzoic acid 2-methoxy-ethyl ester | CHEMBL99927
TypeSmall organic molecule
Emp. Form.C12H14N4O7S3
Mol. Mass.422.457
SMILESCOCCOC(=O)c1ccc(cc1)S(=O)(=O)Nc1nnc(s1)S(N)(=O)=O