Reaction Details
TargetCarbonic anhydrase 4
LigandBDBM10886
Substrate/Competitorn/a
Meas. Tech.ChEBML_45429
Ki 12±n/a nM
Citation Casini, AScozzafava, AMincione, FMenabuoni, LStarnotti, MSupuran, CT Carbonic anhydrase inhibitors: topically acting antiglaucoma sulfonamides incorporating esters and amides of 3- and 4-carboxybenzolamide. Bioorg Med Chem Lett13:2867-73 (2003) Carbonic anhydrase 4
Name:Carbonic anhydrase 4
Type:Enzyme
Mol. Mass.:35152.74
Organism:Bos taurus (bovine)
Description:Bovine isozyme, isolated from lung microsomes
Residue:312
BDBM10886
NameBDBM10886
Synonyms:2-N-benzene-1,3,4-thiadiazole-2,5-disulfonamide Benzolamide CHEMBL73962
TypeSmall organic molecule
Emp. Form.C8H8N4O4S3
Mol. Mass.320.369
SMILESNS(=O)(=O)c1nnc(NS(=O)(=O)c2ccccc2)s1