Reaction Details
TargetCarbonic anhydrase 1
LigandBDBM10886
Substrate/Competitorn/a
Meas. Tech.ChEBML_47522
Ki 15±n/a nM
Citation Casini, AScozzafava, AMincione, FMenabuoni, LStarnotti, MSupuran, CT Carbonic anhydrase inhibitors: topically acting antiglaucoma sulfonamides incorporating esters and amides of 3- and 4-carboxybenzolamide. Bioorg Med Chem Lett13:2867-73 (2003) Carbonic anhydrase 1
Name:Carbonic anhydrase 1
Type:Enzyme
Mol. Mass.:28873.37
Organism:Homo sapiens (Human)
Description:P00915
Residue:261
BDBM10886
NameBDBM10886
Synonyms:2-N-benzene-1,3,4-thiadiazole-2,5-disulfonamide Benzolamide CHEMBL73962
TypeSmall organic molecule
Emp. Form.C8H8N4O4S3
Mol. Mass.320.369
SMILESNS(=O)(=O)c1nnc(NS(=O)(=O)c2ccccc2)s1