Reaction Details
TargetCarbonic anhydrase 2
LigandBDBM50135607
Substrate/Competitorn/a
Meas. Tech.ChEBML_45085
Ki 3.3±n/a nM
Citation Casini, AScozzafava, AMincione, FMenabuoni, LStarnotti, MSupuran, CT Carbonic anhydrase inhibitors: topically acting antiglaucoma sulfonamides incorporating esters and amides of 3- and 4-carboxybenzolamide. Bioorg Med Chem Lett13:2867-73 (2003) Carbonic anhydrase 2
Name:Carbonic anhydrase 2
Type:Enzyme
Mol. Mass.:29250.71
Organism:Homo sapiens (Human)
Description:P00918
Residue:260
BDBM50135607
NameBDBM50135607
Synonyms:3-[3-Methyl-5-sulfamoyl-3H-[1,3,4]thiadiazol-(2E)-ylidenesulfamoyl]-benzoic acid 2-methoxy-ethyl ester | CHEMBL95421
TypeSmall organic molecule
Emp. Form.C13H16N4O7S3
Mol. Mass.436.484
SMILESCOCCOC(=O)c1cccc(c1)S(=O)(=O)\N=c1\sc(nn1C)S(N)(=O)=O