Reaction Details
TargetLow affinity immunoglobulin epsilon Fc receptor
LigandBDBM50132447
Substrate/Competitorn/a
Meas. Tech.ChEBML_163803
EC50 20700±n/a nM
Citation Lai, JYCox, PJPatel, RSadiq, SAldous, DJThurairatnam, SSmith, KWheeler, DJagpal, SParveen, SFenton, GHarrison, TKMcCarthy, CBamborough, P Potent small molecule inhibitors of spleen tyrosine kinase (Syk). Bioorg Med Chem Lett13:3111-4 (2003) Low affinity immunoglobulin epsilon Fc receptor
Name:Low affinity immunoglobulin epsilon Fc receptor
Type:PROTEIN
Mol. Mass.:36461.84
Organism:Homo sapiens (Human)
Description:ChEMBL_88888
Residue:321
BDBM50132447
NameBDBM50132447
Synonyms:5-[5-Methoxy-3-(2-oxo-5-sulfamoyl-1,2-dihydro-indol-3-ylidenemethyl)-indol-1-yl]-pentanoic acid | CHEMBL105438
TypeSmall organic molecule
Emp. Form.C23H23N3O6S
Mol. Mass.469.51
SMILESCOc1ccc2n(CCCCC(O)=O)cc(\C=C3/C(=O)Nc4ccc(cc34)S(N)(=O)=O)c2c1