Reaction Details
TargetPeroxisome proliferator-activated receptor alpha
LigandBDBM50132565
Substrate/Competitorn/a
Meas. Tech.ChEBML_153546
Ki 65±n/a nM
Citation Adams, ADHu, Zvon Langen, DDadiz, AElbrecht, AMacNaul, KLBerger, JPZhou, GDoebber, TWMeurer, RForrest, MJMoller, DEJones, AB O-arylmandelic acids as highly selective human PPAR alpha/gamma agonists. Bioorg Med Chem Lett13:3185-90 (2003) Peroxisome proliferator-activated receptor alpha
Name:Peroxisome proliferator-activated receptor alpha
Type:Enzyme
Mol. Mass.:52222.08
Organism:Homo sapiens (Human)
Description:Q07869
Residue:468
BDBM50132565
NameBDBM50132565
Synonyms:(5,7-Dipropyl-3-trifluoromethyl-benzo[d]isoxazol-6-yloxy)-[4-(2-pyridin-2-yl-ethyl)-phenyl]-acetic acid | CHEMBL110408
TypeSmall organic molecule
Emp. Form.C29H29F3N2O4
Mol. Mass.526.5468
SMILESCCCc1cc2c(noc2c(CCC)c1OC(C(O)=O)c1ccc(CCc2ccccn2)cc1)C(F)(F)F