Reaction Details
TargetPeroxisome proliferator-activated receptor alpha
LigandBDBM50132561
Substrate/Competitorn/a
Meas. Tech.ChEMBL_153546 (CHEMBL766087)
Ki 64±n/a nM
Citation Adams, ADHu, Zvon Langen, DDadiz, AElbrecht, AMacNaul, KLBerger, JPZhou, GDoebber, TWMeurer, RForrest, MJMoller, DEJones, AB O-arylmandelic acids as highly selective human PPAR alpha/gamma agonists. Bioorg Med Chem Lett13:3185-90 (2003) Peroxisome proliferator-activated receptor alpha
Name:Peroxisome proliferator-activated receptor alpha
Type:Enzyme
Mol. Mass.:52222.08
Organism:Homo sapiens (Human)
Description:Q07869
Residue:468
BDBM50132561
NameBDBM50132561
Synonyms:(5,7-Dipropyl-3-trifluoromethyl-benzo[d]isoxazol-6-yloxy)-[4-(pyridin-2-ylmethoxy)-phenyl]-acetic acid | CHEMBL421602
TypeSmall organic molecule
Emp. Form.C28H27F3N2O5
Mol. Mass.528.5196
SMILESCCCc1cc2c(noc2c(CCC)c1OC(C(O)=O)c1ccc(OCc2ccccn2)cc1)C(F)(F)F