Reaction Details
TargetBeta-secretase 1
LigandBDBM50136343
Substrate/Competitorn/a
Meas. Tech.ChEMBL_41375 (CHEMBL653498)
IC50 46±n/a nM
Citation Hu, JCwi, CLSmiley, DLTimm, DErickson, JAMcGee, JEYang, HCMendel, DMay, PCShapiro, MMcCarthy, JR Design and synthesis of statine-containing BACE inhibitors. Bioorg Med Chem Lett13:4335-9 (2003) Beta-secretase 1
Name:Beta-secretase 1
Type:Protein
Mol. Mass.:55755.10
Organism:Homo sapiens (Human)
Description:P56817
Residue:501
BDBM50136343
NameBDBM50136343
Synonyms:CHEMBL137755 | Glu-Val-Asn-statine-Val-Ala-Glu-Phe
TypeSmall organic molecule
Emp. Form.C44H69N9O15
Mol. Mass.964.07
SMILESCC(C)C[C@H](NC(=O)[C@H](CC(N)=O)NC(=O)[C@@H](NC(=O)[C@@H](N)CCC(O)=O)C(C)C)[C@@H](O)CC(=O)N[C@@H](C(C)C)C(=O)N[C@@H](C)C(=O)N[C@@H](CCC(O)=O)C(=O)N[C@@H](Cc1ccccc1)C(O)=O