Reaction Details
TargetBeta-secretase 1
LigandBDBM50136347
Substrate/Competitorn/a
Meas. Tech.ChEMBL_41375 (CHEMBL653498)
IC50 58±n/a nM
Citation Hu, JCwi, CLSmiley, DLTimm, DErickson, JAMcGee, JEYang, HCMendel, DMay, PCShapiro, MMcCarthy, JR Design and synthesis of statine-containing BACE inhibitors. Bioorg Med Chem Lett13:4335-9 (2003) Beta-secretase 1
Name:Beta-secretase 1
Type:Protein
Mol. Mass.:55755.10
Organism:Homo sapiens (Human)
Description:P56817
Residue:501
BDBM50136347
NameBDBM50136347
Synonyms:CHEMBL335837 | Glu-Val-Met-statine-Val-Ala-Glu-Phe
TypeSmall organic molecule
Emp. Form.C45H72N8O14S
Mol. Mass.981.163
SMILESCSCC[C@H](NC(=O)[C@@H](NC(=O)[C@@H](N)CCC(O)=O)C(C)C)C(=O)N[C@@H](CC(C)C)[C@@H](O)CC(=O)N[C@@H](C(C)C)C(=O)N[C@@H](C)C(=O)N[C@@H](CCC(O)=O)C(=O)N[C@@H](Cc1ccccc1)C(O)=O