Reaction Details
TargetMethionine aminopeptidase 2
LigandBDBM50137405
Substrate/Competitorn/a
Meas. Tech.ChEBML_105146
IC50 0.390000±n/a nM
Citation Pyun, HJFardis, MTario, JYang, CYRuckman, JHenninger, DJin, HKim, CU Investigation of novel fumagillin analogues as angiogenesis inhibitors. Bioorg Med Chem Lett14:91-4 (2003) Methionine aminopeptidase 2
Name:Methionine aminopeptidase 2
Type:Enzyme
Mol. Mass.:52884.45
Organism:Homo sapiens (Human)
Description:P50579
Residue:478
BDBM50137405
NameBDBM50137405
Synonyms:CHEMBL176975 | Carbamic acid (3R,4S,5S,6R)-5-methoxy-4-[(2R,3R)-2-methyl-3-(3-methyl-but-2-enyl)-oxiranyl]-1-oxa-spiro[2.5]oct-6-yl ester
TypeSmall organic molecule
Emp. Form.C17H27NO5
Mol. Mass.325.4
SMILES[#6]-[#8]-[#6@@H]-1-[#6@@H](-[#6]-[#6][C@]2([#6]-[#8]2)[#6@H]-1[C@@]1([#6])[#8]-[#6@@H]1-[#6]\[#6]=[#6](/[#6])-[#6])-[#8]-[#6](-[#7])=O