Reaction Details
TargetMethionine aminopeptidase 2
LigandBDBM50137406
Substrate/Competitorn/a
Meas. Tech.ChEBML_105146
IC50 1.2±n/a nM
Citation Pyun, HJFardis, MTario, JYang, CYRuckman, JHenninger, DJin, HKim, CU Investigation of novel fumagillin analogues as angiogenesis inhibitors. Bioorg Med Chem Lett14:91-4 (2003) Methionine aminopeptidase 2
Name:Methionine aminopeptidase 2
Type:Enzyme
Mol. Mass.:52884.45
Organism:Homo sapiens (Human)
Description:P50579
Residue:478
BDBM50137406
NameBDBM50137406
Synonyms:Acetic acid (3R,4S,5S,6R)-4-{1-[(E)-benzyloxyimino]-ethyl}-5-methoxy-1-oxa-spiro[2.5]oct-6-yl ester | CHEMBL174250
TypeSmall organic molecule
Emp. Form.C19H25NO5
Mol. Mass.347.4055
SMILESCO[C@@H]1[C@@H](CC[C@]2(CO2)[C@H]1\C(C)=N\OCc1ccccc1)OC(C)=O