Reaction Details
TargetVoltage-dependent calcium channel subunit alpha-2/delta-1
LigandBDBM50145313
Substrate/Competitorn/a
Meas. Tech.ChEMBL_32525 (CHEMBL641406)
IC50 131±n/a nM
Citation Lebsack, ADGunzner, JWang, BPracitto, RSchaffhauser, HSantini, AAiyar, JBezverkov, RMunoz, BLiu, WVenkatraman, S Identification and synthesis of [1,2,4]triazolo[3,4-a]phthalazine derivatives as high-affinity ligands to the alpha 2 delta-1 subunit of voltage gated calcium channel. Bioorg Med Chem Lett14:2463-7 (2004) 
 
Voltage-dependent calcium channel subunit alpha-2/delta-1
Name:Voltage-dependent calcium channel subunit alpha-2/delta-1
Type:Enzyme
Mol. Mass.:124544.88
Organism:Homo sapiens (Human)
Description:P54289
Residue:1103
BDBM50145313
NameBDBM50145313
Synonyms:CHEMBL81850 | [6-(3-Methoxymethyl-[1,2,4]triazolo[3,4-a]phthalazin-6-yloxymethyl)-pyridin-2-ylmethyl]-phenethyl-amine
TypeSmall organic molecule
Emp. Form.C26H26N6O2
Mol. Mass.454.5236
SMILESCOCc1nnc2c3ccccc3c(OCc3cccc(CNCCc4ccccc4)n3)nn12