Reaction Details
TargetSphingosine 1-phosphate receptor 2
LigandBDBM50147703
Substrate/Competitorn/a
Meas. Tech.ChEBML_201322
IC50>10000±n/a nM
Citation Hale, JJDoherty, GToth, LLi, ZMills, SGHajdu, RAnn Keohane, CRosenbach, MMilligan, JShei, GJChrebet, GBergstrom, JCard, DRosen, HMandala, S The discovery of 3-(N-alkyl)aminopropylphosphonic acids as potent S1P receptor agonists. Bioorg Med Chem Lett14:3495-9 (2004) 
 
Sphingosine 1-phosphate receptor 2
Name:Sphingosine 1-phosphate receptor 2
Type:G Protein-Coupled Receptor (GPCR)
Mol. Mass.:38883.16
Organism:Homo sapiens (Human)
Description:Membranes isolated from S1P2-transfected CHO cells were used in ligand binding assay.
Residue:353
BDBM50147703
NameBDBM50147703
Synonyms:CHEMBL115554 [(1S,3R)-3-Amino-1-hydroxy-5-(4-octyl-phenyl)-pentyl]-phosphonic acid
TypeSmall organic molecule
Emp. Form.C19H34NO4P
Mol. Mass.371.4513
SMILESCCCCCCCCc1ccc(CC[C@@H](N)CC(=O)P(O)(O)O)cc1