Reaction Details
TargetSphingosine 1-phosphate receptor 3
LigandBDBM50148399
Substrate/Competitorn/a
Meas. Tech.ChEBML_201331
IC50 6.3±n/a nM
Citation Hale, JJDoherty, GToth, LLi, ZMills, SGHajdu, RAnn Keohane, CRosenbach, MMilligan, JShei, GJChrebet, GBergstrom, JCard, DRosen, HMandala, S The discovery of 3-(N-alkyl)aminopropylphosphonic acids as potent S1P receptor agonists. Bioorg Med Chem Lett14:3495-9 (2004) 
 
Sphingosine 1-phosphate receptor 3
Name:Sphingosine 1-phosphate receptor 3
Type:G Protein-Coupled Receptor (GPCR)
Mol. Mass.:42278.13
Organism:Homo sapiens (Human)
Description:Q99500
Residue:378
BDBM50148399
NameBDBM50148399
Synonyms:CHEMBL117130 | Phosphoric acid mono-[1-amino-1-hydroxymethyl-3-(4-octyl-phenyl)-propyl] ester
TypeSmall organic molecule
Emp. Form.C18H32NO5P
Mol. Mass.373.4241
SMILESCCCCCCCCc1ccc(CCC(N)(CO)OP(O)(O)=O)cc1