Reaction Details
TargetSphingosine 1-phosphate receptor 1
LigandBDBM50148401
Substrate/Competitorn/a
Meas. Tech.ChEBML_201314
IC50 15±n/a nM
Citation Hale, JJDoherty, GToth, LLi, ZMills, SGHajdu, RAnn Keohane, CRosenbach, MMilligan, JShei, GJChrebet, GBergstrom, JCard, DRosen, HMandala, S The discovery of 3-(N-alkyl)aminopropylphosphonic acids as potent S1P receptor agonists. Bioorg Med Chem Lett14:3495-9 (2004) 
 
Sphingosine 1-phosphate receptor 1
Name:Sphingosine 1-phosphate receptor 1
Type:Enzyme
Mol. Mass.:42836.02
Organism:Homo sapiens (Human)
Description:P21453
Residue:382
BDBM50148401
NameBDBM50148401
Synonyms:(3-Amino-13-phenyl-tridecyl)-phosphonic acid | CHEMBL117031
TypeSmall organic molecule
Emp. Form.C19H34NO3P
Mol. Mass.355.4519
SMILESNC(CCCCCCCCCCc1ccccc1)CCP(O)(O)=O