Reaction Details
TargetSphingosine 1-phosphate receptor 1
LigandBDBM50148402
Substrate/Competitorn/a
Meas. Tech.ChEBML_201314
IC50 12±n/a nM
Citation Hale, JJDoherty, GToth, LLi, ZMills, SGHajdu, RAnn Keohane, CRosenbach, MMilligan, JShei, GJChrebet, GBergstrom, JCard, DRosen, HMandala, S The discovery of 3-(N-alkyl)aminopropylphosphonic acids as potent S1P receptor agonists. Bioorg Med Chem Lett14:3495-9 (2004) 
 
Sphingosine 1-phosphate receptor 1
Name:Sphingosine 1-phosphate receptor 1
Type:Enzyme
Mol. Mass.:42836.02
Organism:Homo sapiens (Human)
Description:P21453
Residue:382
BDBM50148402
NameBDBM50148402
Synonyms:hydrogen (3-{[(4-nonylphenyl)methyl]amino}propyl)phosphonite
TypeSmall organic molecule
Emp. Form.C19H33NO2P
Mol. Mass.338.4451
SMILESCCCCCCCCCc1ccc(CNCCCP(O)[O-])cc1