Reaction Details
TargetSphingosine 1-phosphate receptor 1
LigandBDBM50148406
Substrate/Competitorn/a
Meas. Tech.ChEBML_201314
IC50 44±n/a nM
Citation Hale, JJDoherty, GToth, LLi, ZMills, SGHajdu, RAnn Keohane, CRosenbach, MMilligan, JShei, GJChrebet, GBergstrom, JCard, DRosen, HMandala, S The discovery of 3-(N-alkyl)aminopropylphosphonic acids as potent S1P receptor agonists. Bioorg Med Chem Lett14:3495-9 (2004) 
 
Sphingosine 1-phosphate receptor 1
Name:Sphingosine 1-phosphate receptor 1
Type:Enzyme
Mol. Mass.:42836.02
Organism:Homo sapiens (Human)
Description:P21453
Residue:382
BDBM50148406
NameBDBM50148406
Synonyms:2,2-Difluoro-4-(4-nonyl-benzylamino)-butyric acid | CHEMBL119516
TypeSmall organic molecule
Emp. Form.C20H31F2NO2
Mol. Mass.355.4624
SMILESCCCCCCCCCc1ccc(CNCCC(F)(F)C(O)=O)cc1