Reaction Details
TargetSphingosine 1-phosphate receptor 3
LigandBDBM50148391
Substrate/Competitorn/a
Meas. Tech.ChEBML_201331
IC50 4.3±n/a nM
Citation Hale, JJDoherty, GToth, LLi, ZMills, SGHajdu, RAnn Keohane, CRosenbach, MMilligan, JShei, GJChrebet, GBergstrom, JCard, DRosen, HMandala, S The discovery of 3-(N-alkyl)aminopropylphosphonic acids as potent S1P receptor agonists. Bioorg Med Chem Lett14:3495-9 (2004) 
 
Sphingosine 1-phosphate receptor 3
Name:Sphingosine 1-phosphate receptor 3
Type:G Protein-Coupled Receptor (GPCR)
Mol. Mass.:42278.13
Organism:Homo sapiens (Human)
Description:Q99500
Residue:378
BDBM50148391
NameBDBM50148391
Synonyms:CHEMBL325193 | {3-[2-(4-Octyl-phenyl)-ethylamino]-propyl}-phosphonic acid
TypeSmall organic molecule
Emp. Form.C19H34NO3P
Mol. Mass.355.4519
SMILESCCCCCCCCc1ccc(CCNCCCP(O)(O)=O)cc1