Reaction Details
TargetSphingosine 1-phosphate receptor 1
LigandBDBM50148407
Substrate/Competitorn/a
Meas. Tech.ChEBML_201314
IC50 6.6±n/a nM
Citation Hale, JJDoherty, GToth, LLi, ZMills, SGHajdu, RAnn Keohane, CRosenbach, MMilligan, JShei, GJChrebet, GBergstrom, JCard, DRosen, HMandala, S The discovery of 3-(N-alkyl)aminopropylphosphonic acids as potent S1P receptor agonists. Bioorg Med Chem Lett14:3495-9 (2004) 
 
Sphingosine 1-phosphate receptor 1
Name:Sphingosine 1-phosphate receptor 1
Type:Enzyme
Mol. Mass.:42836.02
Organism:Homo sapiens (Human)
Description:P21453
Residue:382
BDBM50148407
NameBDBM50148407
Synonyms:(3-Pentadecylamino-propyl)-phosphonic acid | CHEMBL117973
TypeSmall organic molecule
Emp. Form.C18H40NO3P
Mol. Mass.349.4889
(O)(O)=O