Reaction Details
TargetSphingosine 1-phosphate receptor 1
LigandBDBM50148395
Substrate/Competitorn/a
Meas. Tech.ChEBML_201314
IC50 22±n/a nM
Citation Hale, JJDoherty, GToth, LLi, ZMills, SGHajdu, RAnn Keohane, CRosenbach, MMilligan, JShei, GJChrebet, GBergstrom, JCard, DRosen, HMandala, S The discovery of 3-(N-alkyl)aminopropylphosphonic acids as potent S1P receptor agonists. Bioorg Med Chem Lett14:3495-9 (2004) 
 
Sphingosine 1-phosphate receptor 1
Name:Sphingosine 1-phosphate receptor 1
Type:Enzyme
Mol. Mass.:42836.02
Organism:Homo sapiens (Human)
Description:P21453
Residue:382
BDBM50148395
NameBDBM50148395
Synonyms:2-Hydroxy-4-(4-nonyl-benzylamino)-butyric acid | CHEMBL118068
TypeSmall organic molecule
Emp. Form.C20H33NO3
Mol. Mass.335.4809
SMILESCCCCCCCCCc1ccc(CNCCC(O)C(O)=O)cc1