Reaction Details
TargetSphingosine 1-phosphate receptor 1
LigandBDBM50148400
Substrate/Competitorn/a
Meas. Tech.ChEBML_201314
IC50 2±n/a nM
Citation Hale, JJDoherty, GToth, LLi, ZMills, SGHajdu, RAnn Keohane, CRosenbach, MMilligan, JShei, GJChrebet, GBergstrom, JCard, DRosen, HMandala, S The discovery of 3-(N-alkyl)aminopropylphosphonic acids as potent S1P receptor agonists. Bioorg Med Chem Lett14:3495-9 (2004) 
 
Sphingosine 1-phosphate receptor 1
Name:Sphingosine 1-phosphate receptor 1
Type:Enzyme
Mol. Mass.:42836.02
Organism:Homo sapiens (Human)
Description:P21453
Residue:382
BDBM50148400
NameBDBM50148400
Synonyms:CHEMBL432809 | Methyl-[3-(4-nonyl-benzylamino)-propyl]-phosphinic acid
TypeSmall organic molecule
Emp. Form.C20H36NO2P
Mol. Mass.353.4791
SMILESCCCCCCCCCc1ccc(CNCCCP(C)(O)=O)cc1