Reaction Details
TargetSphingosine 1-phosphate receptor 4
LigandBDBM50148389
Substrate/Competitorn/a
Meas. Tech.ChEBML_201448
IC50 76±n/a nM
Citation Hale, JJDoherty, GToth, LLi, ZMills, SGHajdu, RAnn Keohane, CRosenbach, MMilligan, JShei, GJChrebet, GBergstrom, JCard, DRosen, HMandala, S The discovery of 3-(N-alkyl)aminopropylphosphonic acids as potent S1P receptor agonists. Bioorg Med Chem Lett14:3495-9 (2004) 
 
Sphingosine 1-phosphate receptor 4
Name:Sphingosine 1-phosphate receptor 4
Type:G Protein-Coupled Receptor (GPCR)
Mol. Mass.:41647.39
Organism:Homo sapiens (Human)
Description:n/a
Residue:384
BDBM50148389
NameBDBM50148389
Synonyms:(3-Amino-heptadecyl)-phosphonic acid | CHEMBL119110
TypeSmall organic molecule
Emp. Form.C17H38NO3P
Mol. Mass.335.4623
(N)CCP(O)(O)=O