Reaction Details
TargetSphingosine 1-phosphate receptor 3
LigandBDBM50148408
Substrate/Competitorn/a
Meas. Tech.ChEBML_201331
IC50 40±n/a nM
Citation Hale, JJDoherty, GToth, LLi, ZMills, SGHajdu, RAnn Keohane, CRosenbach, MMilligan, JShei, GJChrebet, GBergstrom, JCard, DRosen, HMandala, S The discovery of 3-(N-alkyl)aminopropylphosphonic acids as potent S1P receptor agonists. Bioorg Med Chem Lett14:3495-9 (2004) 
 
Sphingosine 1-phosphate receptor 3
Name:Sphingosine 1-phosphate receptor 3
Type:G Protein-Coupled Receptor (GPCR)
Mol. Mass.:42278.13
Organism:Homo sapiens (Human)
Description:Q99500
Residue:378
BDBM50148408
NameBDBM50148408
Synonyms:(3-Amino-pentadecyl)-phosphonic acid | CHEMBL421234
TypeSmall organic molecule
Emp. Form.C15H34NO3P
Mol. Mass.307.4091
SMILESCCCCCCCCCCCCC(N)CCP(O)(O)=O